{"text_format":"1","workbook":"xlsx","n_sheets":8,"sheets":["Systeem","SjabloonVoorblad","SjabloonWerkproces","KerntakenEnWerkprocessen","Beheersingsniveaus","Voorblad","B1-K2-W1","B1-K2-W2"],"not_rendered":{"charts":0,"images":0,"macros":1,"external_links":0,"defined_names":17,"comments":4,"pivot_tables":0},"unopened":[],"bounds":{"document_bytes":16777216,"sheet_cells":100000,"rows_first":2000,"rows_last":500,"rows_between":2000,"halvings":0,"cell_chars":16384,"cell_head_chars":4096},"cells_cut":0,"cells_raw":0,"read":"whole","date_system":"1900"}

{"sheet":"Systeem","index":0,"n_rows":21,"n_cols":3,"rows_kept":21,"cut":false,"hidden":true,"merged":[]}
[]
[null,"Ja/Nee"]
[null,"Ja"]
[null,"Nee"]
[]
[null,"Debug modus"]
[null,0,"Normale bedrijfsstand =  0"]
[]
[null,"Teksten"]
[null,"Werkproces motivatie:","Doe dit volgens richtlijnen van de school. Het is raadzaam om in elk geval een onvoldoende te motiveren.\nBij de motivering kan gebruikgemaakt worden van de beschrijvingen in de beoordelingstabel.\n"]
[]
[null,"Fout markeer opmaak:"]
[]
[]
[null,"\"Grey-out\" opmaak:","greyed out"]
[]
[null,"Copyright tekst:","© Stichting Praktijkleren"]
[]
[null,"Regel afbreken werkprocesnaam:",45]
[]
{"$rows_left_out":2}
{"sheet":"SjabloonVoorblad","index":1,"n_rows":14,"n_cols":3,"rows_kept":14,"cut":false,"hidden":true,"merged":[[2,0,2,2],[13,1,13,2],[11,1,11,2],[0,0,0,2],[6,1,6,2],[7,1,7,2],[5,1,5,2],[9,1,9,2],[8,1,8,2]]}
["Beoordelingsformulier praktijkexamen"]
[]
["Algemene informatie"]
[]
["Code beoordelingsformulier en vaststellingsdatum",{"$f":"KerntakenEnWerkprocessen!B4","v":"BF_AM-EX_IT20_B1-K2_2"},{"$f":"KerntakenEnWerkprocessen!B3","v":"2020-12-22"}]
["Examenvorm",{"$f":"KerntakenEnWerkprocessen!C6","v":"Praktijkexamen"}]
["Examennaam",{"$f":"KerntakenEnWerkprocessen!B7","v":"[Examennaam]"}]
["Examencode",{"$f":"KerntakenEnWerkprocessen!C7","v":"[Examencode]"}]
["Profiel",{"$f":"KerntakenEnWerkprocessen!B9","v":"Allround medewerker IT systems and devices, niveau 3\nExpert IT systems and devices, niveau 4"}]
["Kwalificatiedossier",{"$f":"KerntakenEnWerkprocessen!B8","v":"IT systems and devices"}]
["Cohort en crebocode",{"$f":"KerntakenEnWerkprocessen!C8","v":"2020 en verder"},{"$f":"KerntakenEnWerkprocessen!C9","v":"25605\n25606"}]
["Kerntaak",{"$f":"KerntakenEnWerkprocessen!C5","v":"Beheert de infrastructuur"}]
[]
["Werkprocessen",{"$f":"KerntakenEnWerkprocessen!F2","v":"B1-K2-W1 Installeert en configureert netwerk- en infrastructuuronderdelen\nB1-K2-W2 Beheert en monitort netwerk- en infrastructuuronderdelen\n \n \n \n \n \n \n \n \n \n \n \n \n \n"}]

{"sheet":"SjabloonWerkproces","index":2,"n_rows":19,"n_cols":4,"rows_kept":19,"cut":false,"hidden":true,"merged":[[9,1,9,6],[10,1,10,6],[12,1,12,6]]}
["Werkproces:",null,{"$f":"VLOOKUP(B1,werkprocessen,2,FALSE)","v":{"$error":"#N/A"}}]
["Eerste opdracht:",{"$f":"VLOOKUP(B1,KerntakenEnWerkprocessen!B13:E27,3,FALSE)","v":{"$error":"#N/A"}}]
["Laatste opdracht:",{"$f":"VLOOKUP(B1,KerntakenEnWerkprocessen!B13:E27,4,FALSE)","v":{"$error":"#N/A"}}]
["PuntentotaalMax",{"$f":"SUM(N:N)","v":0},"Invullen gestart:",{"$f":"IF(SUM(O:O)>0,TRUE,FALSE)","v":false}]
["PuntentotaalBehaald",{"$f":"SUM(M:M)","v":0}]
["#Ant. Mog. <=1",{"$f":"COUNTIF(N:N,1)","v":0}]
["#Ant. Mog. 2-3",{"$f":"COUNTIF(N:N,2)+COUNTIF(N:N,3)","v":0}]
["Cesuur",{"$f":"0.5*B4","v":0}]
[]
[null,{"$f":"CONCATENATE(kerntaakCode,\": \",kerntaakNaam)","v":"B1-K2: Beheert de infrastructuur"}]
[null,{"$f":"CONCATENATE(VLOOKUP(B1,werkprocessen,1,FALSE),\": \",C1)","v":{"$error":"#N/A"}}]
[]
[null,"Persoonsinformatie"]
[null,"Datum"]
[null,"Kandidaat"]
[null,"Studentnummer"]
[null,"Klas"]
[null,"Beoordelaar 1"]
[null,"Beoordelaar 2"]

{"sheet":"KerntakenEnWerkprocessen","index":3,"n_rows":29,"n_cols":6,"rows_kept":29,"cut":false,"hidden":true,"merged":[[3,1,3,2]]}
["Kerntaken en werkprocessen"]
[null,null,null,null,null,{"$f":"F27","v":"B1-K2-W1 Installeert en configureert netwerk- en infrastructuuronderdelen\nB1-K2-W2 Beheert en monitort netwerk- en infrastructuuronderdelen\n \n \n \n \n \n \n \n \n \n \n \n \n \n"}]
["Vaststellingsdatum","2020-12-22"]
["Code beoordelingsformulier","BF_AM-EX_IT20_B1-K2_2"]
["Kerntaak","B1-K2","Beheert de infrastructuur"]
["Examenvorm",null,"Praktijkexamen"]
["Examennaam en Examencode","[Examennaam]","[Examencode]"]
["Kwalificatiedossier en Cohort","IT systems and devices","2020 en verder"]
["Profiel en crebocode","Allround medewerker IT systems and devices, niveau 3\nExpert IT systems and devices, niveau 4","25605\n25606"]
[]
[]
["Werkprocessen","Code","Naam","EersteOpdracht","LaatsteOpdracht","TekstSamengevoegd"]
[null,"B1-K2-W1","Installeert en configureert netwerk- en infrastructuuronderdelen",{"$f":"MIN(IF(Beheersingsniveaus!$A$4:$A$153=KerntakenEnWerkprocessen!$B13,Beheersingsniveaus!$B$4:$B$153))","v":1},{"$f":"MAX(IF(Beheersingsniveaus!$A$4:$A$153=KerntakenEnWerkprocessen!$B13,Beheersingsniveaus!$B$4:$B$153))","v":1},{"$f":"B13&\" \"&C13&CHAR(10)","v":"B1-K2-W1 Installeert en configureert netwerk- en infrastructuuronderdelen\n"}]
[null,"B1-K2-W2","Beheert en monitort netwerk- en infrastructuuronderdelen",{"$f":"MIN(IF(Beheersingsniveaus!$A$4:$A$153=KerntakenEnWerkprocessen!$B14,Beheersingsniveaus!$B$4:$B$153))","v":2},{"$f":"MAX(IF(Beheersingsniveaus!$A$4:$A$153=KerntakenEnWerkprocessen!$B14,Beheersingsniveaus!$B$4:$B$153))","v":2},{"$f":"F13&B14&\" \"&C14&CHAR(10)","v":"B1-K2-W1 Installeert en configureert netwerk- en infrastructuuronderdelen\nB1-K2-W2 Beheert en monitort netwerk- en infrastructuuronderdelen\n"}]
[null,null,null,{"$f":"MIN(IF(Beheersingsniveaus!$A$4:$A$153=KerntakenEnWerkprocessen!$B15,Beheersingsniveaus!$B$4:$B$153))","v":0},{"$f":"MAX(IF(Beheersingsniveaus!$A$4:$A$153=KerntakenEnWerkprocessen!$B15,Beheersingsniveaus!$B$4:$B$153))","v":0},{"$f":"F14&B15&\" \"&C15&CHAR(10)","v":"B1-K2-W1 Installeert en configureert netwerk- en infrastructuuronderdelen\nB1-K2-W2 Beheert en monitort netwerk- en infrastructuuronderdelen\n \n"}]
[null,null,null,{"$f":"MIN(IF(Beheersingsniveaus!$A$4:$A$153=KerntakenEnWerkprocessen!$B16,Beheersingsniveaus!$B$4:$B$153))","v":0},{"$f":"MAX(IF(Beheersingsniveaus!$A$4:$A$153=KerntakenEnWerkprocessen!$B16,Beheersingsniveaus!$B$4:$B$153))","v":0},"B1-K2-W1 Installeert en configureert netwerk- en infrastructuuronderdelen\nB1-K2-W2 Beheert en monitort netwerk- en infrastructuuronderdelen\n \n \n"]
[null,null,null,{"$f":"MIN(IF(Beheersingsniveaus!$A$4:$A$153=KerntakenEnWerkprocessen!$B17,Beheersingsniveaus!$B$4:$B$153))","v":0},{"$f":"MAX(IF(Beheersingsniveaus!$A$4:$A$153=KerntakenEnWerkprocessen!$B17,Beheersingsniveaus!$B$4:$B$153))","v":0},"B1-K2-W1 Installeert en configureert netwerk- en infrastructuuronderdelen\nB1-K2-W2 Beheert en monitort netwerk- en infrastructuuronderdelen\n \n \n \n"]
[null,null,null,{"$f":"MIN(IF(Beheersingsniveaus!$A$4:$A$153=KerntakenEnWerkprocessen!$B18,Beheersingsniveaus!$B$4:$B$153))","v":0},{"$f":"MAX(IF(Beheersingsniveaus!$A$4:$A$153=KerntakenEnWerkprocessen!$B18,Beheersingsniveaus!$B$4:$B$153))","v":0},"B1-K2-W1 Installeert en configureert netwerk- en infrastructuuronderdelen\nB1-K2-W2 Beheert en monitort netwerk- en infrastructuuronderdelen\n \n \n \n \n"]
[null,null,null,{"$f":"MIN(IF(Beheersingsniveaus!$A$4:$A$153=KerntakenEnWerkprocessen!$B19,Beheersingsniveaus!$B$4:$B$153))","v":0},{"$f":"MAX(IF(Beheersingsniveaus!$A$4:$A$153=KerntakenEnWerkprocessen!$B19,Beheersingsniveaus!$B$4:$B$153))","v":0},"B1-K2-W1 Installeert en configureert netwerk- en infrastructuuronderdelen\nB1-K2-W2 Beheert en monitort netwerk- en infrastructuuronderdelen\n \n \n \n \n \n"]
[null,null,null,{"$f":"MIN(IF(Beheersingsniveaus!$A$4:$A$153=KerntakenEnWerkprocessen!$B20,Beheersingsniveaus!$B$4:$B$153))","v":0},{"$f":"MAX(IF(Beheersingsniveaus!$A$4:$A$153=KerntakenEnWerkprocessen!$B20,Beheersingsniveaus!$B$4:$B$153))","v":0},"B1-K2-W1 Installeert en configureert netwerk- en infrastructuuronderdelen\nB1-K2-W2 Beheert en monitort netwerk- en infrastructuuronderdelen\n \n \n \n \n \n \n"]
{"$rows_left_out":10}
{"sheet":"Beheersingsniveaus","index":4,"n_rows":153,"n_cols":11,"rows_kept":153,"cut":false,"hidden":true,"merged":[]}
["Beschrijvingen beheersingsniveaus"]
[]
["Werkproces","Opdracht","OpdrachtId","CriteriumId","Taken","Criterium","Beheersingsniveau 0","Beheersingsniveau 1","Beheersingsniveau 2","Beheersingsniveau 3","Cruciaal"]
["B1-K2-W1",1,{"$f":"IF(A4<>\"\",CONCATENATE(A4,\"-\",B4),\"\")","v":"B1-K2-W1-1"},{"$f":"IF(C4<>\"\",CONCATENATE(C4,\"-\",\"1\"),\"\")","v":"B1-K2-W1-1-1"},"T1","Installeren van infrastructuur-devices","Infrastructuur-devices zijn conform opdracht geїnstalleerd.\n\nNiet of nauwelijks\n\n","Enigszins","Grotendeels","Volledig"]
["B1-K2-W1",1,{"$f":"IF(A5<>\"\",CONCATENATE(A5,\"-\",B5),\"\")","v":"B1-K2-W1-1"},{"$f":"IF(C5<>\"\",CONCATENATE(C5,\"-\",COUNTIF($C$4:C5,C5),\"\"),\"\")","v":"B1-K2-W1-1-2"},"T1","Configureren van infrastructuur-devices","Infrastructuur-devices zijn conform opdracht geconfigureerd.\n\nNiet of nauwelijks","Enigszins","Grotendeels","Volledig"]
["B1-K2-W1",1,"B1-K2-W1-1",{"$f":"IF(C6<>\"\",CONCATENATE(C6,\"-\",COUNTIF($C$4:C6,C6),\"\"),\"\")","v":"B1-K2-W1-1-3"},"T2","Testen","De werking van de infrastructuur-devices is getest. Eventuele fouten zijn gelokaliseerd en op passende wijze afgehandeld.\n\nNiet of nauwelijks","Enigszins","Grotendeels","Volledig"]
["B1-K2-W2",2,"B1-K2-W2-2",{"$f":"IF(C7<>\"\",CONCATENATE(C7,\"-\",COUNTIF($C$4:C7,C7),\"\"),\"\")","v":"B1-K2-W2-2-1"},"T1","Gekozen tools","De juiste tools zijn correct gebruikt.\n\nNiet of nauwelijks","Enigszins","Grotendeels","Volledig"]
["B1-K2-W2",2,"B1-K2-W2-2",{"$f":"IF(C8<>\"\",CONCATENATE(C8,\"-\",COUNTIF($C$4:C8,C8),\"\"),\"\")","v":"B1-K2-W2-2-2"},"T2","Beheerwerkzaam-heden","De beheerwerkzaam-heden zijn conform opdracht uitgevoerd.\n\nNiet of nauwelijks","Enigszins","Grotendeels","Volledig"]
["B1-K2-W2",2,"B1-K2-W2-2",{"$f":"IF(C9<>\"\",CONCATENATE(C9,\"-\",COUNTIF($C$4:C9,C9),\"\"),\"\")","v":"B1-K2-W2-2-3"},"T3","Verbeteringen aanbrengen of adviseren","De onderdelen van het netwerk/de infrastructuur voldoen aan de gestelde onderhouds- en veiligheidseisen of er is advies uitgebracht over verbeteringen.\n\nNiet of nauwelijks","Enigszins","Grotendeels","Volledig"]
[null,null,"",{"$f":"IF(C10<>\"\",CONCATENATE(C10,\"-\",COUNTIF($C$4:C10,C10),\"\"),\"\")","v":""}]
[null,null,"",{"$f":"IF(C11<>\"\",CONCATENATE(C11,\"-\",COUNTIF($C$4:C11,C11),\"\"),\"\")","v":""}]
[null,null,"",{"$f":"IF(C12<>\"\",CONCATENATE(C12,\"-\",COUNTIF($C$4:C12,C12),\"\"),\"\")","v":""}]
[null,null,"",{"$f":"IF(C13<>\"\",CONCATENATE(C13,\"-\",COUNTIF($C$4:C13,C13),\"\"),\"\")","v":""}]
[null,null,"",{"$f":"IF(C14<>\"\",CONCATENATE(C14,\"-\",COUNTIF($C$4:C14,C14),\"\"),\"\")","v":""}]
[null,null,"",{"$f":"IF(C15<>\"\",CONCATENATE(C15,\"-\",COUNTIF($C$4:C15,C15),\"\"),\"\")","v":""}]
[null,null,"",{"$f":"IF(C16<>\"\",CONCATENATE(C16,\"-\",COUNTIF($C$4:C16,C16),\"\"),\"\")","v":""}]
[null,null,"",{"$f":"IF(C17<>\"\",CONCATENATE(C17,\"-\",COUNTIF($C$4:C17,C17),\"\"),\"\")","v":""}]
[null,null,"",{"$f":"IF(C18<>\"\",CONCATENATE(C18,\"-\",COUNTIF($C$4:C18,C18),\"\"),\"\")","v":""}]
[null,null,"",{"$f":"IF(C19<>\"\",CONCATENATE(C19,\"-\",COUNTIF($C$4:C19,C19),\"\"),\"\")","v":""}]
[null,null,"",{"$f":"IF(C20<>\"\",CONCATENATE(C20,\"-\",COUNTIF($C$4:C20,C20),\"\"),\"\")","v":""}]
{"$rows_left_out":134}
{"sheet":"Voorblad","index":5,"n_rows":28,"n_cols":4,"rows_kept":28,"cut":false,"hidden":false,"merged":[[9,1,9,2],[11,1,11,2],[13,1,13,2],[0,0,0,2],[2,0,2,2],[5,1,5,2],[6,1,6,2],[7,1,7,2],[8,1,8,2],[20,1,20,2],[21,1,21,2],[23,2,25,2],[15,0,15,2],[16,1,16,2],[17,1,17,2],[18,1,18,2],[19,1,19,2]]}
["Beoordelingsformulier praktijkexamen"]
[]
["Algemene informatie"]
[]
["Code beoordelingsformulier en vaststellingsdatum",{"$f":"KerntakenEnWerkprocessen!B4","v":"BF_AM-EX_IT20_B1-K2_2"},"2021-07-13"]
["Examenvorm",{"$f":"KerntakenEnWerkprocessen!C6","v":"Praktijkexamen"}]
["Examennaam",{"$f":"KerntakenEnWerkprocessen!B7","v":"[Examennaam]"}]
["Examencode",{"$f":"KerntakenEnWerkprocessen!C7","v":"[Examencode]"}]
["Profiel",{"$f":"KerntakenEnWerkprocessen!B9","v":"Allround medewerker IT systems and devices, niveau 3\nExpert IT systems and devices, niveau 4"}]
["Kwalificatiedossier",{"$f":"KerntakenEnWerkprocessen!B8","v":"IT systems and devices"}]
["Cohort en crebocode",{"$f":"KerntakenEnWerkprocessen!C8","v":"2020 en verder"},{"$f":"KerntakenEnWerkprocessen!C9","v":"25605\n25606"}]
["Kerntaak",{"$f":"KerntakenEnWerkprocessen!C5","v":"Beheert de infrastructuur"}]
[]
["Werkprocessen",{"$f":"KerntakenEnWerkprocessen!F2","v":"B1-K2-W1 Installeert en configureert netwerk- en infrastructuuronderdelen\nB1-K2-W2 Beheert en monitort netwerk- en infrastructuuronderdelen\n \n \n \n \n \n \n \n \n \n \n \n \n \n"}]
[]
["Persoonsinformatie"]
["Datum",null,null," [Vul alleen de gele cellen in]"]
["Kandidaat"]
["Leerlingnummer"]
["Klas"]
{"$rows_left_out":9}
{"sheet":"B1-K2-W1","index":6,"n_rows":45,"n_cols":15,"rows_kept":45,"cut":false,"hidden":false,"merged":[[45,1,45,6],[9,1,9,6],[10,1,10,6],[12,1,12,6],[20,1,20,6],[27,1,27,6],[44,1,44,6]]}
["Werkproces:","B1-K2-W1",{"$f":"VLOOKUP(B1,werkprocessen,2,FALSE)","v":"Installeert en configureert netwerk- en infrastructuuronderdelen"}]
["Eerste opdracht:",{"$f":"VLOOKUP(B1,KerntakenEnWerkprocessen!B13:E27,3,FALSE)","v":1}]
["Laatste opdracht:",{"$f":"VLOOKUP(B1,KerntakenEnWerkprocessen!B13:E27,4,FALSE)","v":1}]
["PuntentotaalMax",{"$f":"SUM(N:N)","v":9},"Invullen gestart:",{"$f":"IF(SUM(O:O)>0,TRUE,FALSE)","v":true}]
["PuntentotaalBehaald",{"$f":"SUM(M:M)","v":0}]
["#Ant. Mog. <=1",{"$f":"COUNTIF(N:N,1)","v":0}]
["#Ant. Mog. 2-3",{"$f":"COUNTIF(N:N,2)+COUNTIF(N:N,3)","v":3}]
["Cesuur",{"$f":"0.5*B4","v":4.5}]
[]
[null,{"$f":"CONCATENATE(kerntaakCode,\": \",kerntaakNaam)","v":"B1-K2: Beheert de infrastructuur"}]
[null,{"$f":"CONCATENATE(VLOOKUP(B1,werkprocessen,1,FALSE),\": \",C1)","v":"B1-K2-W1: Installeert en configureert netwerk- en infrastructuuronderdelen"}]
[]
[null,"Persoonsinformatie"]
[null,"Datum",{"$f":"IF(Voorblad!B17=\"\",\"\",Voorblad!B17)","v":""}]
[null,"Kandidaat",{"$f":"IF(Voorblad!B18=\"\",\"\",Voorblad!B18)","v":""}]
[null,"Studentnummer",{"$f":"IF(Voorblad!B19=\"\",\"\",Voorblad!B19)","v":""}]
[null,"Klas",{"$f":"IF(Voorblad!B20=\"\",\"\",Voorblad!B20)","v":""}]
[null,"Beoordelaar 1",{"$f":"IF(Voorblad!B21=\"\",\"\",Voorblad!B21)","v":""}]
[null,"Beoordelaar 2",{"$f":"IF(Voorblad!B22=\"\",\"\",Voorblad!B22)","v":""}]
[]
{"$rows_left_out":26}
{"sheet":"B1-K2-W2","index":7,"n_rows":45,"n_cols":15,"rows_kept":45,"cut":false,"hidden":false,"merged":[[45,1,45,6],[9,1,9,6],[10,1,10,6],[12,1,12,6],[20,1,20,6],[27,1,27,6],[44,1,44,6]]}
["Werkproces:","B1-K2-W2",{"$f":"VLOOKUP(B1,werkprocessen,2,FALSE)","v":"Beheert en monitort netwerk- en infrastructuuronderdelen"}]
["Eerste opdracht:",{"$f":"VLOOKUP(B1,KerntakenEnWerkprocessen!B13:E27,3,FALSE)","v":2}]
["Laatste opdracht:",{"$f":"VLOOKUP(B1,KerntakenEnWerkprocessen!B13:E27,4,FALSE)","v":2}]
["PuntentotaalMax",{"$f":"SUM(N:N)","v":9},"Invullen gestart:",{"$f":"IF(SUM(O:O)>0,TRUE,FALSE)","v":true}]
["PuntentotaalBehaald",{"$f":"SUM(M:M)","v":0}]
["#Ant. Mog. <=1",{"$f":"COUNTIF(N:N,1)","v":0}]
["#Ant. Mog. 2-3",{"$f":"COUNTIF(N:N,2)+COUNTIF(N:N,3)","v":3}]
["Cesuur",{"$f":"0.5*B4","v":4.5}]
[]
[null,{"$f":"CONCATENATE(kerntaakCode,\": \",kerntaakNaam)","v":"B1-K2: Beheert de infrastructuur"}]
[null,{"$f":"CONCATENATE(VLOOKUP(B1,werkprocessen,1,FALSE),\": \",C1)","v":"B1-K2-W2: Beheert en monitort netwerk- en infrastructuuronderdelen"}]
[]
[null,"Persoonsinformatie"]
[null,"Datum",{"$f":"IF(Voorblad!B17=\"\",\"\",Voorblad!B17)","v":""}]
[null,"Kandidaat",{"$f":"IF(Voorblad!B18=\"\",\"\",Voorblad!B18)","v":""}]
[null,"Studentnummer",{"$f":"IF(Voorblad!B19=\"\",\"\",Voorblad!B19)","v":""}]
[null,"Klas",{"$f":"IF(Voorblad!B20=\"\",\"\",Voorblad!B20)","v":""}]
[null,"Beoordelaar 1",{"$f":"IF(Voorblad!B21=\"\",\"\",Voorblad!B21)","v":""}]
[null,"Beoordelaar 2",{"$f":"IF(Voorblad!B22=\"\",\"\",Voorblad!B22)","v":""}]
[]
{"$rows_left_out":25}